Meet Canary

Canary is part of Code Valet which provides radically transparent feedback for the service's operation. Canary allows developers to triage and understand issues affecting Code Valet, or one of its components.

Recent deployments

The alpha channel was last rebuilt on: Sun Feb 18 16:53:11 UTC 2018

The general availability channel was last rebuilt on: Tue Jan 16 17:56:13 UTC 2018

Recent issues

Canary

1 Faraday::TimeoutError: Net::ReadTimeout
app/canary/dao/jenkins.rb in rebuilt_for at line 45

View · View in Sentry

1 Errno::ECONNREFUSED: Failed to open TCP connection to app.getsentry.com:443 (Connection refused - connect(2) for "app....
app/canary/dao/sentry.rb in block in issues_for at line 58

View · View in Sentry

19474 Faraday::TimeoutError: Net::ReadTimeout
app/canary/dao/jenkins.rb in rebuilt_for at line 45

View · View in Sentry

1 NoMethodError: undefined method `size' for nil:NilClass
app/../views/index.haml in block (2 levels) in singleton class at line 53

View · View in Sentry

Code Valet Webapp

No recent events (yay).

Code Valet

258 GitException: java.lang.reflect.InvocationTargetException
io.jenkins.blueocean.autofavorite.FavoritingScmListener.onCheckout

View · View in Sentry

30 AzureCloudException: AzureVMCloud: createProvisionedAgent: Deployment docker-ubuntu0216172223623 failed, max timeout r...
hudson.slaves.NodeProvisioner$2.run

View · View in Sentry

15 InvocationTargetException
io.jenkins.blueocean.commons.stapler.export.ExportInterceptor$1.getValue

View · View in Sentry

1 InvocationTargetException
io.jenkins.blueocean.commons.stapler.export.ExportInterceptor$1.getValue

View · View in Sentry

7918 AzureCloudException
hudson.slaves.NodeProvisioner$2.run

View · View in Sentry

11832 CloudException: Status code 400, {"error":{"code":"InvalidTemplateDeployment","message":"The template deployment ...
com.microsoft.azure.vmagent.AzureVMManagementServiceDelegate.createDeployment

View · View in Sentry

2 AzureCloudException
hudson.slaves.NodeProvisioner$2.run

View · View in Sentry

1 java.net.SocketTimeoutException: timeout
com.microsoft.azure.vmagent.AzureVMManagementServiceDelegate.createStorageAccount

View · View in Sentry

2 java.net.SocketTimeoutException: timeout
com.microsoft.azure.vmagent.AzureVMManagementServiceDelegate.createStorageAccount

View · View in Sentry

3 AzureCloudException: Failed to create storage account with account name codevaletimages, location westus, resourceGrou...
com.microsoft.azure.vmagent.AzureVMManagementServiceDelegate.createDeployment

View · View in Sentry

2294 A connection to https://management.azure.com/ was leaked. Did you forget to close a response body?
okhttp3.internal.platform.Platform.log

View · View in Sentry

3364 The request is being throttled.
com.microsoft.azure.vmagent.AzureVMManagementServiceDelegate.createStorageAccount

View · View in Sentry

3365 AzureCloudException: Failed to create storage account with account name codevaletimages, location westus, resourceGrou...
com.microsoft.azure.vmagent.AzureVMManagementServiceDelegate.createDeployment

View · View in Sentry

2242 AzureCloudException
hudson.slaves.NodeProvisioner$2.run

View · View in Sentry

1 The request is being throttled.
com.microsoft.azure.vmagent.AzureVMManagementServiceDelegate.createStorageAccount

View · View in Sentry

1 AzureCloudException: Failed to create storage account with account name codevaletimages, location westus, resourceGrou...
com.microsoft.azure.vmagent.AzureVMManagementServiceDelegate.createDeployment

View · View in Sentry

46 CloudException: Status code 400, {"error":{"code":"InvalidTemplateDeployment","message":"The template deployment ...
com.microsoft.azure.vmagent.AzureVMManagementServiceDelegate.createDeployment

View · View in Sentry

2276 IllegalStateException
hudson.XmlFile.replaceIfNotAtTopLevel

View · View in Sentry

12 IllegalStateException: delivered here
org.jenkinsci.plugins.workflow.cps.CpsStepContext.completed

View · View in Sentry

1 AzureCloudException
hudson.slaves.NodeProvisioner$2.run

View · View in Sentry

1 CloudException: Status code 400, {"error":{"code":"InvalidTemplateDeployment","message":"The template deployment ...
com.microsoft.azure.vmagent.AzureVMManagementServiceDelegate.createDeployment

View · View in Sentry

1 CloudException: Status code 400, {"error":{"code":"InvalidTemplateDeployment","message":"The template deployment ...
com.microsoft.azure.vmagent.AzureVMManagementServiceDelegate.createDeployment

View · View in Sentry

3 InvocationTargetException
org.eclipse.jetty.server.handler.ContextHandler$Context.log

View · View in Sentry

189 ConcurrentModificationException
java.util.Hashtable$Enumerator in next

View · View in Sentry

27 InvocationTargetException
org.eclipse.jetty.server.handler.ContextHandler$Context.log

View · View in Sentry

40 FileNotFoundException: /var/jenkins_home/deployment.out (No such file or directory)
com.microsoft.azure.vmagent.AzureVMAgentCleanUpTask$DeploymentRegistrar.<init>

View · View in Sentry

61 http://codevalet.codevalet.io:443/manage vs. https://codevalet.codevalet.io/manage
hudson.diagnosis.ReverseProxySetupMonitor.getTestForReverseProxySetup

View · View in Sentry

4 NullPointerException: There is no credentials with admin access to manage hooks on GitHubRepositoryName[host=github.com...
org.jenkinsci.plugins.github.webhook.WebhookManager$2.applyNullSafe

View · View in Sentry

2 Owner[canary/48620/2:canary/48620 #2] was not in the list to begin with: [Owner[canary/master/6:c...
org.jenkinsci.plugins.workflow.flow.FlowExecutionList.unregister

View · View in Sentry

2 Client error: java.io.IOException: Server returned HTTP response code: 504 for URL: https://app.d...
org.datadog.jenkins.plugins.datadog.DatadogHttpRequests.post

View · View in Sentry

2 took 255ms to load/not load org/jenkinsci/plugins/pipeline/modeldefinition/model/AbstractBuildCon...
org.jenkinsci.plugins.scriptsecurity.sandbox.groovy.SandboxResolvingClassLoader$4$1.load

View · View in Sentry



Jenkins® is a registered trademark of Software in the Public Interest, Inc.